omap3: clocks: Fix build error 'CK_3430ES2' undeclared here
At latest mainline commit 0c21e3aaf6a, omap2plus build is broken. This
patch is trivial fix for the missed usb clock node for CK_3430ES2PLUS
flag update.
CHK include/generated/compile.h
CC arch/arm/mach-omap2/clock3xxx_data.o
arch/arm/mach-omap2/clock3xxx_data.c:3289: error: 'CK_3430ES2' undeclared
here (not in a function)
make[1]: *** [arch/arm/mach-omap2/clock3xxx_data.o] Error 1
make: *** [arch/arm/mach-omap2] Error 2
Signed-off-by: Santosh Shilimkar <santosh.shilimkar@ti.com>
Acked-by: Anand Gadiyar <gadiyar@ti.com>
Acked-by: Paul Walmsley <paul@pwsan.com>
[tony@atomide.com: updated mask to include CK_36XX]
Signed-off-by: Tony Lindgren <tony@atomide.com>
diff --git a/arch/arm/mach-omap2/clock3xxx_data.c b/arch/arm/mach-omap2/clock3xxx_data.c
index d3ab1c9e..403a4a1 100644
--- a/arch/arm/mach-omap2/clock3xxx_data.c
+++ b/arch/arm/mach-omap2/clock3xxx_data.c
@@ -3286,7 +3286,7 @@
CLK(NULL, "cpefuse_fck", &cpefuse_fck, CK_3430ES2PLUS | CK_AM35XX | CK_36XX),
CLK(NULL, "ts_fck", &ts_fck, CK_3430ES2PLUS | CK_AM35XX | CK_36XX),
CLK(NULL, "usbtll_fck", &usbtll_fck, CK_3430ES2PLUS | CK_AM35XX | CK_36XX),
- CLK("ehci-omap.0", "usbtll_fck", &usbtll_fck, CK_3430ES2 | CK_AM35XX),
+ CLK("ehci-omap.0", "usbtll_fck", &usbtll_fck, CK_3430ES2PLUS | CK_AM35XX | CK_36XX),
CLK("omap-mcbsp.1", "prcm_fck", &core_96m_fck, CK_3XXX),
CLK("omap-mcbsp.5", "prcm_fck", &core_96m_fck, CK_3XXX),
CLK(NULL, "core_96m_fck", &core_96m_fck, CK_3XXX),